Target
Sphingosine 1-phosphate receptor 1
Ligand
BDBM50335507
Substrate
Meas. Tech.
ChEMBL_702151 (CHEMBL1655488)
EC50
38±n/a nM
Citation
 Cee, VJFrohn, MLanman, BAGolden, JMuller, KNeira, SPickrell, AArnett, HBuys, JGore, AFiorino, MHorner, MItano, ALee, MRMcElvain, MMiddleton, SSchrag, MRivenzon-Segal, DVargas, HMXu, HXu, YZhang, XSiu, JWong, M Discovery of AMG 369, a Thiazolo[5,4-b]pyridine Agonist of S1P1 and S1P5 ACS Med Chem Lett 2:107-112 (2011)  
Target
Name:
Sphingosine 1-phosphate receptor 1
Synonyms:
CHEDG1 Endothelial differentiation G-protein coupled receptor 1 S1P1 S1PR1_HUMAN Sphingosine 1-phosphate receptor Edg-1
Type:
Enzyme
Mol. Mass.:
42836.02
Organism:
Homo sapiens (Human)
Description:
P21453
Residue:
382
  
Inhibitor
Name:
BDBM50335507
Synonyms:
1-((3-fluoro-4-(6-(1-phenylcyclopropyl)benzo[d]thiazol-2-yl)phenyl)methyl)azetidine-3-carboxylic acid | CHEMBL1651865
Type:
Small organic molecule
Emp. Form.:
C27H23FN2O2S
Mol. Mass.:
458.547
SMILES:
OC(=O)C1CN(Cc2ccc(-c3nc4ccc(cc4s3)C3(CC3)c3ccccc3)c(F)c2)C1
: