Target
Sphingosine 1-phosphate receptor 1
Ligand
BDBM50335510
Substrate
Meas. Tech.
ChEMBL_702151 (CHEMBL1655488)
EC50
33±n/a nM
Citation
 Cee, VJFrohn, MLanman, BAGolden, JMuller, KNeira, SPickrell, AArnett, HBuys, JGore, AFiorino, MHorner, MItano, ALee, MRMcElvain, MMiddleton, SSchrag, MRivenzon-Segal, DVargas, HMXu, HXu, YZhang, XSiu, JWong, M Discovery of AMG 369, a Thiazolo[5,4-b]pyridine Agonist of S1P1 and S1P5 ACS Med Chem Lett 2:107-112 (2011)  
Target
Name:
Sphingosine 1-phosphate receptor 1
Synonyms:
CHEDG1 Endothelial differentiation G-protein coupled receptor 1 S1P1 S1PR1_HUMAN Sphingosine 1-phosphate receptor Edg-1
Type:
Enzyme
Mol. Mass.:
42836.02
Organism:
Homo sapiens (Human)
Description:
P21453
Residue:
382
  
Inhibitor
Name:
BDBM50335510
Synonyms:
1-(3-fluoro-4-(5-(2-phenylpropan-2-yl)thiazolo[5,4-b]pyridin-2-yl)benzyl)azetidine-3-carboxylic acid | CHEMBL1651860
Type:
Small organic molecule
Emp. Form.:
C26H24FN3O2S
Mol. Mass.:
461.551
SMILES:
CC(C)(c1ccccc1)c1ccc2nc(sc2n1)-c1ccc(CN2CC(C2)C(O)=O)cc1F
: