Target
Sigma non-opioid intracellular receptor 1
Ligand
BDBM36184
Substrate
Meas. Tech.
ChEMBL_714958 (CHEMBL1663953)
Ki
>10000±n/a nM
Citation
 Marrazzo, AFiorito, JZappalà, LPrezzavento, ORonsisvalle, SPasquinucci, LScoto, GMBernardini, RRonsisvalle, G Antiproliferative activity of phenylbutyrate ester of haloperidol metabolite II [(±)-MRJF4] in prostate cancer cells. Eur J Med Chem 46:433-8 (2010)  
Target
Name:
Sigma non-opioid intracellular receptor 1
Synonyms:
OPRS1 SIGMAR1 Sigma non-opioid intracellular receptor 1 Sigma1-receptor Sterol isomerase-like protein
Type:
Protein
Mol. Mass.:
25307.17
Organism:
Cavia porcellus (Guinea pig)
Description:
Q60492
Residue:
223
  
Inhibitor
Name:
BDBM36184
Synonyms:
4-phenylbutanoate
Type:
Guest
Emp. Form.:
C10H11O2
Mol. Mass.:
163.1937
SMILES:
[O-]C(=O)CCCc1ccccc1
: