Target
cGMP-specific 3',5'-cyclic phosphodiesterase
Ligand
BDBM50335850
Substrate
Meas. Tech.
ChEMBL_715329 (CHEMBL1664616)
IC50
2300±n/a nM
Citation
 Mohamed, HAGirgis, NMWilcken, RBauer, MRTinsley, HNGary, BDPiazza, GABoeckler, FMAbadi, AH Synthesis and molecular modeling of novel tetrahydro-ß-carboline derivatives with phosphodiesterase 5 inhibitory and anticancer properties. J Med Chem 54:495-509 (2011)  
Target
Name:
cGMP-specific 3',5'-cyclic phosphodiesterase
Synonyms:
3',5'-cyclic phosphodiesterase PDE5 PDE5A_HUMAN Phosphodiesterase 5 (PDE5) Phosphodiesterase 5A (PDE5A) cGMP-specific 3',5'-cyclic phosphodiesterase
Type:
Protein
Mol. Mass.:
99975.83
Organism:
Homo sapiens (Human)
Description:
O76074
Residue:
875
  
Inhibitor
Name:
BDBM50335850
Synonyms:
(1R,3R)Methyl 1-(2,4-Dichlorophenyl)-2-(2-chloroacetyl)-2,3,4,9-tetrahydro-1H-beta-carboline-3-carboxylate | CHEMBL1650693
Type:
Small organic molecule
Emp. Form.:
C21H17Cl3N2O3
Mol. Mass.:
451.73
SMILES:
COC(=O)[C@H]1Cc2c([nH]c3ccccc23)[C@H](N1C(=O)CCl)c1ccc(Cl)cc1Cl
: