Target
Mineralocorticoid receptor
Ligand
BDBM50336280
Substrate
Meas. Tech.
ChEMBL_716553 (CHEMBL1670277)
IC50
8930±n/a nM
Citation
 Jiang, CSZhou, RGong, JXChen, LLKurtán, TShen, XGuo, YW Synthesis, modification, and evaluation of (R)-de-O-methyllasiodiplodin and analogs as nonsteroidal antagonists of mineralocorticoid receptor. Bioorg Med Chem Lett 21:1171-5 (2011)  
Target
Name:
Mineralocorticoid receptor
Synonyms:
MCR_RAT Mineralocorticoid Receptor (MR) Mlr Nuclear receptor subfamily 3 group C member 2 | mineralocorticoid
Type:
Enzyme Catalytic Domain
Mol. Mass.:
106748.15
Organism:
RAT
Description:
mineralocorticoid 0 RAT::P22199
Residue:
981
  
Inhibitor
Name:
BDBM50336280
Synonyms:
(R)-de-O-methyllasioplodin | CHEMBL1669749
Type:
Small organic molecule
Emp. Form.:
C16H22O4
Mol. Mass.:
278.3435
SMILES:
C[C@@H]1CCCCCCCc2cc(O)cc(O)c2C(=O)O1
: