Target
Progesterone receptor
Ligand
BDBM50336933
Substrate
Meas. Tech.
ChEMBL_718596 (CHEMBL1680622)
IC50
3.38±n/a nM
Citation
 Richardson, TIClarke, CAYu, KLYee, YKBleisch, TJLopez, JEJones, SAHughes, NEMuehl, BSLugar, CWMoore, TLShetler, PKZink, RWOsborne, JJMontrose-Rafizadeh, CPatel, NGeiser, AGGalvin, RJ Novel 3-Aryl Indoles as Progesterone Receptor Antagonists for Uterine Fibroids ACS Med Chem Lett 2:148-153 (2011)  
Target
Name:
Progesterone receptor
Synonyms:
NR3C3 PGR PRGR_HUMAN | progesterone
Type:
Protein
Mol. Mass.:
98979.52
Organism:
Homo sapiens (Human)
Description:
P06401
Residue:
933
  
Inhibitor
Name:
BDBM50336933
Synonyms:
CHEMBL1672541 | N-(3-(4-cyano-3-methylphenyl)-1-isopropyl-1H-indol-6-yl)methanesulfonamide
Type:
Small organic molecule
Emp. Form.:
C20H21N3O2S
Mol. Mass.:
367.465
SMILES:
CC(C)n1cc(-c2ccc(C#N)c(C)c2)c2ccc(NS(C)(=O)=O)cc12
: