Target
Mineralocorticoid receptor
Ligand
BDBM50228076
Substrate
Meas. Tech.
ChEMBL_718593 (CHEMBL1680619)
Ki
1.51±n/a nM
Citation
 Richardson, TIClarke, CAYu, KLYee, YKBleisch, TJLopez, JEJones, SAHughes, NEMuehl, BSLugar, CWMoore, TLShetler, PKZink, RWOsborne, JJMontrose-Rafizadeh, CPatel, NGeiser, AGGalvin, RJ Novel 3-Aryl Indoles as Progesterone Receptor Antagonists for Uterine Fibroids ACS Med Chem Lett 2:148-153 (2011)  
Target
Name:
Mineralocorticoid receptor
Synonyms:
MCR MLR NR3C2 | Nuclear receptor subfamily 3 group C member 2
Type:
Enzyme
Mol. Mass.:
107076.42
Organism:
Homo sapiens (Human)
Description:
P08235
Residue:
984
  
Inhibitor
Name:
BDBM50228076
Synonyms:
(R)-N-(3-(1-cyclopropyl-1-(2,4-difluorophenyl)ethyl)-1H-indol-7-yl)methanesulfonamide | CHEMBL391231
Type:
Small organic molecule
Emp. Form.:
C20H20F2N2O2S
Mol. Mass.:
390.447
SMILES:
C[C@@](C1CC1)(c1c[nH]c2c(NS(C)(=O)=O)cccc12)c1ccc(F)cc1F
: