Target
Cytochrome P450 2C19
Ligand
BDBM50336981
Substrate
Meas. Tech.
ChEMBL_719026 (CHEMBL1679088)
IC50
1000±n/a nM
Citation
 Eastwood, PEsteve, CGonzález, JFonquerna, SAiguadé, JCarranco, IsDoménech, TAparici, MsMiralpeix, MAlbertí, JCórdoba, MFernández, RPont, MsGodessart, NsPrats, NLoza, MsCadavid, MsNueda, A Discovery of LAS101057: A Potent, Selective, and Orally Efficacious A2B Adenosine Receptor Antagonist ACS Med Chem Lett 2:213-218 (2011)  
Target
Name:
Cytochrome P450 2C19
Synonyms:
(R)-limonene 6-monooxygenase (S)-limonene 7-monooxygenase CYP2C19 CYPIIC19 Cytochrome P450 2C19 [I331V] Cytochrome P450-254C Mephenytoin 4-hydroxylase P450-254C
Type:
Enzyme
Mol. Mass.:
55935.47
Organism:
Homo sapiens (Human)
Description:
P33261
Residue:
490
  
Inhibitor
Name:
BDBM50336981
Synonyms:
CHEMBL1672629 | N-[5-(3,5-Difluoropyridin-4-yl)-6-pyridin-3-ylpyrazin-2-yl]cyclopropane carboxamide
Type:
Small organic molecule
Emp. Form.:
C18H13F2N5O
Mol. Mass.:
353.3255
SMILES:
Fc1cncc(F)c1-c1ncc(NC(=O)C2CC2)nc1-c1cccnc1
: