Target
Cytochrome P450 3A4
Ligand
BDBM50336981
Substrate
Meas. Tech.
ChEMBL_719028 (CHEMBL1679090)
IC50
>25000±n/a nM
Citation
 Eastwood, PEsteve, CGonzález, JFonquerna, SAiguadé, JCarranco, IsDoménech, TAparici, MsMiralpeix, MAlbertí, JCórdoba, MFernández, RPont, MsGodessart, NsPrats, NLoza, MsCadavid, MsNueda, A Discovery of LAS101057: A Potent, Selective, and Orally Efficacious A2B Adenosine Receptor Antagonist ACS Med Chem Lett 2:213-218 (2011)  
Target
Name:
Cytochrome P450 3A4
Synonyms:
Albendazole monooxygenase CP3A4_HUMAN CYP3A4 CYPIIIA4 Cytochrome P450 3A4 (CYP3A4) Nifedipine oxidase Taurochenodeoxycholate 6-alpha-hydroxylase
Type:
Enzyme
Mol. Mass.:
57349.57
Organism:
Homo sapiens (Human)
Description:
Residue:
503
  
Inhibitor
Name:
BDBM50336981
Synonyms:
CHEMBL1672629 | N-[5-(3,5-Difluoropyridin-4-yl)-6-pyridin-3-ylpyrazin-2-yl]cyclopropane carboxamide
Type:
Small organic molecule
Emp. Form.:
C18H13F2N5O
Mol. Mass.:
353.3255
SMILES:
Fc1cncc(F)c1-c1ncc(NC(=O)C2CC2)nc1-c1cccnc1
: