Target
C-X-C chemokine receptor type 3
Ligand
BDBM50337218
Substrate
Meas. Tech.
ChEMBL_726361 (CHEMBL1687493)
IC50
23±n/a nM
Citation
 Shao, YAnilkumar, GNCarroll, CDDong, GHall, JWHobbs, DWJiang, YJenh, CHKim, SHKozlowski, JAMcGuinness, BFRosenblum, SBSchulman, IShih, NYShu, YWong, MKYu, WZawacki, LGZeng, Q II. SAR studies of pyridyl-piperazinyl-piperidine derivatives as CXCR3 chemokine antagonists. Bioorg Med Chem Lett 21:1527-31 (2011)  
Target
Name:
C-X-C chemokine receptor type 3
Synonyms:
AAO92295.1 C-X-C chemokine receptor type 3 (CXCR3) CXCR3 CXCR3_HUMAN chemokine (C-X-C motif) receptor 3
Type:
Enzyme Catalytic Domain
Mol. Mass.:
40665.65
Organism:
Homo sapiens (Human)
Description:
Residue:
368
  
Inhibitor
Name:
BDBM50337218
Synonyms:
(S)-5-chloro-6-(4-(1-(4-chlorobenzyl)piperidin-4-yl)-3-methylpiperazin-1-yl)-N-(3,4-difluorobenzyl)nicotinamide | CHEMBL1681849
Type:
Small organic molecule
Emp. Form.:
C30H33Cl2F2N5O
Mol. Mass.:
588.519
SMILES:
C[C@H]1CN(CCN1C1CCN(Cc2ccc(Cl)cc2)CC1)c1ncc(cc1Cl)C(=O)NCc1ccc(F)c(F)c1
: