Target
Collagenase 3
Ligand
BDBM50337728
Substrate
Meas. Tech.
ChEMBL_728836 (CHEMBL1686371)
IC50
7.6±n/a nM
Citation
 De Savi, CPape, ACumming, JGTing, ASmith, PDBurrows, JNMills, MDavies, CLamont, SMilne, DCook, CMoore, PSawyer, YGerhardt, S The design and synthesis of novel N-hydroxyformamide inhibitors of ADAM-TS4 for the treatment of osteoarthritis. Bioorg Med Chem Lett 21:1376-81 (2011)  
Target
Name:
Collagenase 3
Synonyms:
MMP-13 MMP13_HUMAN Matrix metalloproteinase-13 (MMP-13) | Matrix metalloproteinase-13 (MMP13)
Type:
Enzyme
Mol. Mass.:
53808.06
Organism:
Homo sapiens (Human)
Description:
P45452
Residue:
471
  
Inhibitor
Name:
BDBM50337728
Synonyms:
CHEMBL1683445 US10322143, Compound 3
Type:
Small organic molecule
Emp. Form.:
C21H27F2N5O4S
Mol. Mass.:
483.532
SMILES:
C[C@@H](C[C@@](C)(CS(=O)(=O)N1CCN(CC1)c1ccc(F)cc1)N(O)C=O)c1ncc(F)cn1
: