Target
Mitogen-activated protein kinase 9
Ligand
BDBM50338292
Substrate
Meas. Tech.
ChEMBL_727961 (CHEMBL1686759)
IC50
9±n/a nM
Citation
 Bowers, STruong, APNeitz, RJNeitzel, MProbst, GDHom, RKPeterson, BGalemmo, RAKonradi, AWSham, HLTóth, GPan, HYao, NArtis, DRBrigham, EFQuinn, KPSauer, JMPowell, KRuslim, LRen, ZBard, FYednock, TAGriswold-Prenner, I Design and synthesis of a novel, orally active, brain penetrant, tri-substituted thiophene based JNK inhibitor. Bioorg Med Chem Lett 21:1838-43 (2011)  
Target
Name:
Mitogen-activated protein kinase 9
Synonyms:
JNK-55 JNK2/JNK3 MK09_HUMAN Mitogen-activated protein kinase 8/9 SAPK1A c-Jun N-terminal kinase 2 | c-Jun N-terminal kinase 2 (JNK2)
Type:
Enzyme
Mol. Mass.:
48131.49
Organism:
Homo sapiens (Human)
Description:
JNK-2 was purchased from Upstate Cell Signaling Solutions (formerly Upstate Biotechnology).
Residue:
424
  
Inhibitor
Name:
BDBM50338292
Synonyms:
CHEMBL1682014 | N-(4-chloro-3-(1H-1,2,4-triazol-5-yl)thiophen-2-yl)-2-(2-oxo-3,4-dihydroquinolin-1(2H)-yl)acetamide
Type:
Small organic molecule
Emp. Form.:
C17H14ClN5O2S
Mol. Mass.:
387.843
SMILES:
Clc1csc(NC(=O)CN2C(=O)CCc3ccccc23)c1-c1nnc[nH]1
: