Target
Mitogen-activated protein kinase 9
Ligand
BDBM50338293
Substrate
Meas. Tech.
ChEMBL_727961 (CHEMBL1686759)
IC50
8±n/a nM
Citation
 Bowers, STruong, APNeitz, RJNeitzel, MProbst, GDHom, RKPeterson, BGalemmo, RAKonradi, AWSham, HLTóth, GPan, HYao, NArtis, DRBrigham, EFQuinn, KPSauer, JMPowell, KRuslim, LRen, ZBard, FYednock, TAGriswold-Prenner, I Design and synthesis of a novel, orally active, brain penetrant, tri-substituted thiophene based JNK inhibitor. Bioorg Med Chem Lett 21:1838-43 (2011)  
Target
Name:
Mitogen-activated protein kinase 9
Synonyms:
JNK-55 JNK2/JNK3 MK09_HUMAN Mitogen-activated protein kinase 8/9 SAPK1A c-Jun N-terminal kinase 2 | c-Jun N-terminal kinase 2 (JNK2)
Type:
Enzyme
Mol. Mass.:
48131.49
Organism:
Homo sapiens (Human)
Description:
JNK-2 was purchased from Upstate Cell Signaling Solutions (formerly Upstate Biotechnology).
Residue:
424
  
Inhibitor
Name:
BDBM50338293
Synonyms:
CHEMBL1682015 | N-(4-cyano-3-(1H-1,2,4-triazol-5-yl)thiophen-2-yl)-2-(2-oxo-3,4-dihydroquinolin-1(2H)-yl)acetamide
Type:
Small organic molecule
Emp. Form.:
C18H14N6O2S
Mol. Mass.:
378.408
SMILES:
O=C(CN1C(=O)CCc2ccccc12)Nc1scc(C#N)c1-c1nnc[nH]1
: