Target
Glucocorticoid receptor
Ligand
BDBM50338306
Substrate
Meas. Tech.
ChEMBL_728108 (CHEMBL1687050)
Ki
8±n/a nM
Citation
 Hudson, ARHiguchi, RIRoach, SLAdams, MEVassar, ASyka, PMMais, DEMiner, JNMarschke, KBZhi, L Discovery of orally available tetrahydroquinoline-based glucocorticoid receptor agonists. Bioorg Med Chem Lett 21:1697-700 (2011)  
Target
Name:
Glucocorticoid receptor
Synonyms:
GCR_HUMAN GRL Glucocorticoid receptor (GRFP) Nuclear receptor subfamily 3 group C member 1
Type:
Enzyme
Mol. Mass.:
85656.87
Organism:
Homo sapiens (Human)
Description:
P04150
Residue:
777
  
Inhibitor
Name:
BDBM50338306
Synonyms:
(+/-)-(3R,4S)-5-chloro-8-fluoro-6-(1H-indol-7-yl)-2,2,4-trimethyl-1,2,3,4-tetrahydroquinolin-3-ol | CHEMBL1682436
Type:
Small organic molecule
Emp. Form.:
C20H20ClFN2O
Mol. Mass.:
358.837
SMILES:
C[C@@H]1[C@@H](O)C(C)(C)Nc2c(F)cc(c(Cl)c12)-c1cccc2cc[nH]c12
: