Target
Neuromedin-K receptor
Ligand
BDBM50338374
Substrate
Meas. Tech.
ChEMBL_728272 (CHEMBL1687429)
EC50
2.5±n/a nM
Citation
 Xiong, HKang, JWoods, JMMcCauley, JPKoether, GMAlbert, JSHinkley, LLi, YGadient, RASimpson, TR Synthesis and SAR of sulfoxide substituted carboxyquinolines as NK3 receptor antagonists. Bioorg Med Chem Lett 21:1896-9 (2011)  
Target
Name:
Neuromedin-K receptor
Synonyms:
NK-3 receptor NK3R NKR Neurokinin B receptor Neuromedin-3 receptor (NK-3R) Neuromedin-K receptor Neuromedin-K receptor (NK3) TAC3R Tachykinin receptor 3 | Tachykinin receptor 3 (NK3)
Type:
Enzyme
Mol. Mass.:
52221.96
Organism:
Homo sapiens (Human)
Description:
P29371
Residue:
465
  
Inhibitor
Name:
BDBM50338374
Synonyms:
(S)-3-(methylsulfonylmethyl)-2-phenyl-N-(1-phenylpropyl)quinoline-4-carboxamide | CHEMBL1682944
Type:
Small organic molecule
Emp. Form.:
C27H26N2O3S
Mol. Mass.:
458.572
SMILES:
CC[C@H](NC(=O)c1c(CS(C)(=O)=O)c(nc2ccccc12)-c1ccccc1)c1ccccc1
: