Target
Acyl-CoA desaturase 1
Ligand
BDBM50338525
Substrate
Meas. Tech.
ChEMBL_728487 (CHEMBL1685364)
IC50
25±n/a nM
Citation
 Atkinson, KABeretta, EEBrown, JACastrodad, MChen, YCosgrove, JMDu, PLitchfield, JMakowski, MMartin, KMcLellan, TJNeagu, CPerry, DAPiotrowski, DWSteppan, CMTrilles, R N-benzylimidazole carboxamides as potent, orally active stearoylCoA desaturase-1 inhibitors. Bioorg Med Chem Lett 21:1621-5 (2011)  
Target
Name:
Acyl-CoA desaturase 1
Synonyms:
ACOD1_RAT Scd Stearoyl-CoA desaturase 1 (SCD1)
Type:
Enzyme
Mol. Mass.:
41485.97
Organism:
Rattus norvegicus (Rat)
Description:
P07308
Residue:
358
  
Inhibitor
Name:
BDBM50338525
Synonyms:
CHEMBL1683580 | N-(2-methyl-2H-1,2,3-triazol-4-yl)-1-(3-(trifluoromethyl)benzyl)-1H-imidazole-4-carboxamide
Type:
Small organic molecule
Emp. Form.:
C15H13F3N6O
Mol. Mass.:
350.2985
SMILES:
Cn1ncc(NC(=O)c2cn(Cc3cccc(c3)C(F)(F)F)cn2)n1
: