Target
Acyl-CoA desaturase 1
Ligand
BDBM50338527
Substrate
Meas. Tech.
ChEMBL_728487 (CHEMBL1685364)
IC50
63±n/a nM
Citation
 Atkinson, KABeretta, EEBrown, JACastrodad, MChen, YCosgrove, JMDu, PLitchfield, JMakowski, MMartin, KMcLellan, TJNeagu, CPerry, DAPiotrowski, DWSteppan, CMTrilles, R N-benzylimidazole carboxamides as potent, orally active stearoylCoA desaturase-1 inhibitors. Bioorg Med Chem Lett 21:1621-5 (2011)  
Target
Name:
Acyl-CoA desaturase 1
Synonyms:
ACOD1_RAT Scd Stearoyl-CoA desaturase 1 (SCD1)
Type:
Enzyme
Mol. Mass.:
41485.97
Organism:
Rattus norvegicus (Rat)
Description:
P07308
Residue:
358
  
Inhibitor
Name:
BDBM50338527
Synonyms:
1-(4-chloro-3-(trifluoromethyl)benzyl)-N-(1-methyl-1H-1,2,4-triazol-3-yl)-1H-imidazole-4-carboxamide | CHEMBL1683582
Type:
Small organic molecule
Emp. Form.:
C15H12ClF3N6O
Mol. Mass.:
384.744
SMILES:
Cn1cnc(NC(=O)c2cn(Cc3ccc(Cl)c(c3)C(F)(F)F)cn2)n1
: