Target
Acyl-CoA desaturase 1
Ligand
BDBM50338528
Substrate
Meas. Tech.
ChEMBL_728487 (CHEMBL1685364)
IC50
101±n/a nM
Citation
 Atkinson, KABeretta, EEBrown, JACastrodad, MChen, YCosgrove, JMDu, PLitchfield, JMakowski, MMartin, KMcLellan, TJNeagu, CPerry, DAPiotrowski, DWSteppan, CMTrilles, R N-benzylimidazole carboxamides as potent, orally active stearoylCoA desaturase-1 inhibitors. Bioorg Med Chem Lett 21:1621-5 (2011)  
Target
Name:
Acyl-CoA desaturase 1
Synonyms:
ACOD1_RAT Scd Stearoyl-CoA desaturase 1 (SCD1)
Type:
Enzyme
Mol. Mass.:
41485.97
Organism:
Rattus norvegicus (Rat)
Description:
P07308
Residue:
358
  
Inhibitor
Name:
BDBM50338528
Synonyms:
1-((1-(cyclopropylmethyl)cyclobutyl)methyl)-N-(1-methyl-1H-pyrazol-3-yl)-1H-imidazole-4-carboxamide | CHEMBL1683583
Type:
Small organic molecule
Emp. Form.:
C17H23N5O
Mol. Mass.:
313.3974
SMILES:
Cn1ccc(NC(=O)c2cn(CC3(CC4CC4)CCC3)cn2)n1
: