Target
Acyl-CoA desaturase 1
Ligand
BDBM50338529
Substrate
Meas. Tech.
ChEMBL_728487 (CHEMBL1685364)
IC50
126±n/a nM
Citation
 Atkinson, KABeretta, EEBrown, JACastrodad, MChen, YCosgrove, JMDu, PLitchfield, JMakowski, MMartin, KMcLellan, TJNeagu, CPerry, DAPiotrowski, DWSteppan, CMTrilles, R N-benzylimidazole carboxamides as potent, orally active stearoylCoA desaturase-1 inhibitors. Bioorg Med Chem Lett 21:1621-5 (2011)  
Target
Name:
Acyl-CoA desaturase 1
Synonyms:
ACOD1_RAT Scd Stearoyl-CoA desaturase 1 (SCD1)
Type:
Enzyme
Mol. Mass.:
41485.97
Organism:
Rattus norvegicus (Rat)
Description:
P07308
Residue:
358
  
Inhibitor
Name:
BDBM50338529
Synonyms:
1-(2-chlorophenethyl)-N-(1-methyl-1H-pyrazol-3-yl)-1H-imidazole-4-carboxamide | CHEMBL1683584
Type:
Small organic molecule
Emp. Form.:
C16H16ClN5O
Mol. Mass.:
329.784
SMILES:
Cn1ccc(NC(=O)c2cn(CCc3ccccc3Cl)cn2)n1
: