Target
Acyl-CoA desaturase 1
Ligand
BDBM50338530
Substrate
Meas. Tech.
ChEMBL_728487 (CHEMBL1685364)
IC50
2750±n/a nM
Citation
 Atkinson, KABeretta, EEBrown, JACastrodad, MChen, YCosgrove, JMDu, PLitchfield, JMakowski, MMartin, KMcLellan, TJNeagu, CPerry, DAPiotrowski, DWSteppan, CMTrilles, R N-benzylimidazole carboxamides as potent, orally active stearoylCoA desaturase-1 inhibitors. Bioorg Med Chem Lett 21:1621-5 (2011)  
Target
Name:
Acyl-CoA desaturase 1
Synonyms:
ACOD1_RAT Scd Stearoyl-CoA desaturase 1 (SCD1)
Type:
Enzyme
Mol. Mass.:
41485.97
Organism:
Rattus norvegicus (Rat)
Description:
P07308
Residue:
358
  
Inhibitor
Name:
BDBM50338530
Synonyms:
CHEMBL1683585 | N-(2-acetamidoethyl)-1-(4-fluoro-3-(trifluoromethyl)benzyl)-1H-imidazole-4-carboxamide
Type:
Small organic molecule
Emp. Form.:
C16H16F4N4O2
Mol. Mass.:
372.3175
SMILES:
CC(=O)NCCNC(=O)c1cn(Cc2ccc(F)c(c2)C(F)(F)F)cn1
: