Target
Acyl-CoA desaturase 1
Ligand
BDBM50338534
Substrate
Meas. Tech.
ChEMBL_728487 (CHEMBL1685364)
IC50
2140±n/a nM
Citation
 Atkinson, KABeretta, EEBrown, JACastrodad, MChen, YCosgrove, JMDu, PLitchfield, JMakowski, MMartin, KMcLellan, TJNeagu, CPerry, DAPiotrowski, DWSteppan, CMTrilles, R N-benzylimidazole carboxamides as potent, orally active stearoylCoA desaturase-1 inhibitors. Bioorg Med Chem Lett 21:1621-5 (2011)  
Target
Name:
Acyl-CoA desaturase 1
Synonyms:
ACOD1_RAT Scd Stearoyl-CoA desaturase 1 (SCD1)
Type:
Enzyme
Mol. Mass.:
41485.97
Organism:
Rattus norvegicus (Rat)
Description:
P07308
Residue:
358
  
Inhibitor
Name:
BDBM50338534
Synonyms:
CHEMBL1683589 | N-(1-methyl-1H-pyrazol-3-yl)-1-(3-(trifluoromethyl)benzyl)-1H-pyrazole-3-carboxamide
Type:
Small organic molecule
Emp. Form.:
C16H14F3N5O
Mol. Mass.:
349.3105
SMILES:
Cn1ccc(NC(=O)c2ccn(Cc3cccc(c3)C(F)(F)F)n2)n1
: