Target
Stearoyl-CoA desaturase
Ligand
BDBM50338520
Substrate
Meas. Tech.
ChEMBL_728488 (CHEMBL1685365)
IC50
217±n/a nM
Citation
 Atkinson, KABeretta, EEBrown, JACastrodad, MChen, YCosgrove, JMDu, PLitchfield, JMakowski, MMartin, KMcLellan, TJNeagu, CPerry, DAPiotrowski, DWSteppan, CMTrilles, R N-benzylimidazole carboxamides as potent, orally active stearoylCoA desaturase-1 inhibitors. Bioorg Med Chem Lett 21:1621-5 (2011)  
Target
Name:
Stearoyl-CoA desaturase
Synonyms:
Acyl-CoA desaturase SCD SCDOS Stearoyl-CoA (SCD1) | Stearoyl-CoA desaturase 1
Type:
Enzyme
Mol. Mass.:
41537.27
Organism:
Homo sapiens (Human)
Description:
O00767
Residue:
359
  
Inhibitor
Name:
BDBM50338520
Synonyms:
1-(4-chlorobenzyl)-N-(diaminomethylene)-5-methyl-1H-imidazole-4-carboxamide | CHEMBL1683575
Type:
Small organic molecule
Emp. Form.:
C13H14ClN5O
Mol. Mass.:
291.736
SMILES:
Cc1c(ncn1Cc1ccc(Cl)cc1)C(=O)NC(N)=N
: