Target
Acyl-CoA desaturase 1
Ligand
BDBM50338520
Substrate
Meas. Tech.
ChEMBL_728485 (CHEMBL1685362)
IC50
68±n/a nM
Citation
 Atkinson, KABeretta, EEBrown, JACastrodad, MChen, YCosgrove, JMDu, PLitchfield, JMakowski, MMartin, KMcLellan, TJNeagu, CPerry, DAPiotrowski, DWSteppan, CMTrilles, R N-benzylimidazole carboxamides as potent, orally active stearoylCoA desaturase-1 inhibitors. Bioorg Med Chem Lett 21:1621-5 (2011)  
Target
Name:
Acyl-CoA desaturase 1
Synonyms:
ACOD1_RAT Scd Stearoyl-CoA desaturase 1 (SCD1)
Type:
Enzyme
Mol. Mass.:
41485.97
Organism:
Rattus norvegicus (Rat)
Description:
P07308
Residue:
358
  
Inhibitor
Name:
BDBM50338520
Synonyms:
1-(4-chlorobenzyl)-N-(diaminomethylene)-5-methyl-1H-imidazole-4-carboxamide | CHEMBL1683575
Type:
Small organic molecule
Emp. Form.:
C13H14ClN5O
Mol. Mass.:
291.736
SMILES:
Cc1c(ncn1Cc1ccc(Cl)cc1)C(=O)NC(N)=N
: