Target
Cytochrome P450 1A2
Ligand
BDBM50338522
Substrate
Meas. Tech.
ChEMBL_728486 (CHEMBL1685363)
IC50
>30000±n/a nM
Citation
 Atkinson, KABeretta, EEBrown, JACastrodad, MChen, YCosgrove, JMDu, PLitchfield, JMakowski, MMartin, KMcLellan, TJNeagu, CPerry, DAPiotrowski, DWSteppan, CMTrilles, R N-benzylimidazole carboxamides as potent, orally active stearoylCoA desaturase-1 inhibitors. Bioorg Med Chem Lett 21:1621-5 (2011)  
Target
Name:
Cytochrome P450 1A2
Synonyms:
CP1A2_HUMAN CYPIA2 Cytochrome P(3)450 Cytochrome P450 1A2 (CYP1A2) Cytochrome P450-P3
Type:
Enzyme
Mol. Mass.:
58423.38
Organism:
Homo sapiens (Human)
Description:
P05177
Residue:
516
  
Inhibitor
Name:
BDBM50338522
Synonyms:
5-methyl-N-(1-methyl-1H-pyrazol-3-yl)-1-(3-(trifluoromethyl)benzyl)-1H-imidazole-4-carboxamide | CHEMBL1683577
Type:
Small organic molecule
Emp. Form.:
C17H16F3N5O
Mol. Mass.:
363.337
SMILES:
Cc1c(ncn1Cc1cccc(c1)C(F)(F)F)C(=O)Nc1ccn(C)n1
: