Target
Cytochrome P450 2D6
Ligand
BDBM50338522
Substrate
Meas. Tech.
ChEMBL_728502 (CHEMBL1685379)
IC50
>30000±n/a nM
Citation
 Atkinson, KABeretta, EEBrown, JACastrodad, MChen, YCosgrove, JMDu, PLitchfield, JMakowski, MMartin, KMcLellan, TJNeagu, CPerry, DAPiotrowski, DWSteppan, CMTrilles, R N-benzylimidazole carboxamides as potent, orally active stearoylCoA desaturase-1 inhibitors. Bioorg Med Chem Lett 21:1621-5 (2011)  
Target
Name:
Cytochrome P450 2D6
Synonyms:
CP2D6_HUMAN CYP2DL1 Cytochrome P450 2D6 (CYP2D6) P450-DB1
Type:
Protein
Mol. Mass.:
55774.82
Organism:
Homo sapiens (Human)
Description:
P10635
Residue:
497
  
Inhibitor
Name:
BDBM50338522
Synonyms:
5-methyl-N-(1-methyl-1H-pyrazol-3-yl)-1-(3-(trifluoromethyl)benzyl)-1H-imidazole-4-carboxamide | CHEMBL1683577
Type:
Small organic molecule
Emp. Form.:
C17H16F3N5O
Mol. Mass.:
363.337
SMILES:
Cc1c(ncn1Cc1cccc(c1)C(F)(F)F)C(=O)Nc1ccn(C)n1
: