Target
Polyphenol oxidase 2
Ligand
BDBM50031467
Substrate
Meas. Tech.
ChEMBL_735745 (CHEMBL1693753)
IC50
10200±n/a nM
Citation
 Peralta, MAOrtega, MGAgnese, AMCabrera, JL Prenylated flavanones with anti-tyrosinase activity from Dalea boliviana. J Nat Prod 74:158-62 (2011)  
Target
Name:
Polyphenol oxidase 2
Synonyms:
Monophenol monooxygenase PPO2 Tyrosinase
Type:
Protein
Mol. Mass.:
63923.66
Organism:
Agaricus bisporus (Common mushroom)
Description:
O42713
Residue:
556
  
Inhibitor
Name:
BDBM50031467
Synonyms:
5-HYDROXY-2-(HYDROXYMETHYL)-4H-PYRAN-4-ONE CHEMBL287556 US10857082, Kojic acid US9682910, kojic acid
Type:
Small organic molecule
Emp. Form.:
C6H6O4
Mol. Mass.:
142.1094
SMILES:
OCc1cc(=O)c(O)co1
: