Target
Carbonic anhydrase
Ligand
BDBM50339601
Substrate
Meas. Tech.
ChEMBL_736724 (CHEMBL1695105)
Ki
790±n/a nM
Citation
 Davis, RAHofmann, AOsman, AHall, RAMühlschlegel, FAVullo, DInnocenti, ASupuran, CTPoulsen, SA Natural product-based phenols as novel probes for mycobacterial and fungal carbonic anhydrases. J Med Chem 54:1682-92 (2011)  
Target
Name:
Carbonic anhydrase
Synonyms:
CAN_CANAL beta-Carbonic Anhydrase
Type:
Enzyme
Mol. Mass.:
31587.59
Organism:
Candida albicans (Yeast)
Description:
Residue:
281
  
Inhibitor
Name:
BDBM50339601
Synonyms:
2-(3-chloro-4-hydroxyphenyl)-N-(4-sulfamoylphenethyl)acetamide CHEMBL606453
Type:
Small organic molecule
Emp. Form.:
C16H17ClN2O4S
Mol. Mass.:
368.835
SMILES:
NS(=O)(=O)c1ccc(CCNC(=O)Cc2ccc(O)c(Cl)c2)cc1
: