Target
Beta-carbonic anhydrase 1
Ligand
BDBM50339601
Substrate
Meas. Tech.
ChEMBL_736723 (CHEMBL1695104)
Ki
1160±n/a nM
Citation
 Davis, RAHofmann, AOsman, AHall, RAMühlschlegel, FAVullo, DInnocenti, ASupuran, CTPoulsen, SA Natural product-based phenols as novel probes for mycobacterial and fungal carbonic anhydrases. J Med Chem 54:1682-92 (2011)  
Target
Name:
Beta-carbonic anhydrase 1
Synonyms:
β-Carbonic anhydrase 1 (CA 1) MTCA1_MYCTU canA | mtcA1
Type:
Enzyme
Mol. Mass.:
18186.06
Organism:
Mycobacterium tuberculosis
Description:
The recombinant GST-mtCA1 construct was cloned, expressed, and further purified from E. coli. The purified protein was used in inhibition assays.
Residue:
163
  
Inhibitor
Name:
BDBM50339601
Synonyms:
2-(3-chloro-4-hydroxyphenyl)-N-(4-sulfamoylphenethyl)acetamide CHEMBL606453
Type:
Small organic molecule
Emp. Form.:
C16H17ClN2O4S
Mol. Mass.:
368.835
SMILES:
NS(=O)(=O)c1ccc(CCNC(=O)Cc2ccc(O)c(Cl)c2)cc1
: