Target
Carbonic anhydrase 2
Ligand
BDBM50340066
Substrate
Meas. Tech.
ChEMBL_739879 (CHEMBL1762939)
Ki
110000±n/a nM
Citation
 Carta, FInnocenti, AHall, RAMühlschlegel, FAScozzafava, ASupuran, CT Carbonic anhydrase inhibitors. Inhibition of the β-class enzymes from the fungal pathogens Candida albicans and Cryptococcus neoformans with branched aliphatic/aromatic carboxylates and their derivatives. Bioorg Med Chem Lett 21:2521-6 (2011)  
Target
Name:
Carbonic anhydrase 2
Synonyms:
CA-II CAC Carbonate dehydratase II Carbonic anhydrase 2 (CA-II) Carbonic anhydrase C Carbonic anhydrase II (CA-II) Carbonic anhydrase II (hCA II) | Carbonic anhydrase isoenzyme II (hCA II)
Type:
Enzyme
Mol. Mass.:
29250.71
Organism:
Homo sapiens (Human)
Description:
P00918
Residue:
260
  
Inhibitor
Name:
BDBM50340066
Synonyms:
CHEMBL1762648 | sodium 2-Methylheptanoate
Type:
Small organic molecule
Emp. Form.:
C8H15O2
Mol. Mass.:
143.204
SMILES:
CCCCCC(C)C([O-])=O
: