Target
Corticotropin-releasing factor receptor 1
Ligand
BDBM50340104
Substrate
Meas. Tech.
ChEMBL_741114 (CHEMBL1764385)
IC50
6.5±n/a nM
Citation
 Zuev, DMattson, RJHuang, HMattson, GKZueva, LNielsen, JMKozlowski, ESHuang, XSWu, DGao, QLodge, NJBronson, JJMacor, JE Potential CRF1R PET imaging agents: N-fluoroalkyl-8-(6-methoxy-2-methylpyridin-3-yl)-2,7-dimethyl-N-alkylpyrazolo[1,5-a][1,3,5]triazin-4-amines. Bioorg Med Chem Lett 21:2484-8 (2011)  
Target
Name:
Corticotropin-releasing factor receptor 1
Synonyms:
CRF-R CRFR1_RAT Corticotropin releasing factor receptor Corticotropin-releasing Factor Receptor 1 Crhr | Crhr1
Type:
G Protein-Coupled Receptor (GPCR)
Mol. Mass.:
47870.75
Organism:
Rattus norvegicus (rat)
Description:
Receptor binding assays were performed using rat cortex homogenate.
Residue:
415
  
Inhibitor
Name:
BDBM50340104
Synonyms:
3-((3-fluoropropyl)(8-(6-methoxy-2-methylpyridin-3-yl)-2,7-dimethylpyrazolo[1,5-a][1,3,5]triazin-4-yl)amino)propanenitrile | CHEMBL1762822
Type:
Small organic molecule
Emp. Form.:
C20H24FN7O
Mol. Mass.:
397.4493
SMILES:
COc1ccc(-c2c(C)nn3c(nc(C)nc23)N(CCCF)CCC#N)c(C)n1
: