Target
Corticotropin-releasing factor receptor 1
Ligand
BDBM50340107
Substrate
Meas. Tech.
ChEMBL_741114 (CHEMBL1764385)
IC50
>10000±n/a nM
Citation
 Zuev, DMattson, RJHuang, HMattson, GKZueva, LNielsen, JMKozlowski, ESHuang, XSWu, DGao, QLodge, NJBronson, JJMacor, JE Potential CRF1R PET imaging agents: N-fluoroalkyl-8-(6-methoxy-2-methylpyridin-3-yl)-2,7-dimethyl-N-alkylpyrazolo[1,5-a][1,3,5]triazin-4-amines. Bioorg Med Chem Lett 21:2484-8 (2011)  
Target
Name:
Corticotropin-releasing factor receptor 1
Synonyms:
CRF-R CRFR1_RAT Corticotropin releasing factor receptor Corticotropin-releasing Factor Receptor 1 Crhr | Crhr1
Type:
G Protein-Coupled Receptor (GPCR)
Mol. Mass.:
47870.75
Organism:
Rattus norvegicus (rat)
Description:
Receptor binding assays were performed using rat cortex homogenate.
Residue:
415
  
Inhibitor
Name:
BDBM50340107
Synonyms:
8-(2,4-dimethoxypyrimidin-5-yl)-N-(3-fluoropropyl)-N-(2-methoxyethyl)-2,7-dimethylpyrazolo[1,5-a][1,3,5]triazin-4-amine | CHEMBL1762825
Type:
Small organic molecule
Emp. Form.:
C19H26FN7O3
Mol. Mass.:
419.4532
SMILES:
COCCN(CCCF)c1nc(C)nc2c(c(C)nn12)-c1cnc(OC)nc1OC
: