Target
Melanin-concentrating hormone receptor 1
Ligand
BDBM50340348
Substrate
Meas. Tech.
ChEMBL_740919 (CHEMBL1764020)
IC50
30±n/a nM
Citation
 Lim, CJKim, NLee, EKLee, BHOh, KSYoo, SEYi, KY Synthesis and SAR investigations of novel 2-arylbenzimidazole derivatives as melanin-concentrating hormone receptor 1 (MCH-R1) antagonists. Bioorg Med Chem Lett 21:2309-12 (2011)  
Target
Name:
Melanin-concentrating hormone receptor 1
Synonyms:
G-protein coupled receptor 24 MCH receptor 1 MCH-R1 MCHR-1 MCHR1_HUMAN Melanin-Concentrating Hormone Receptor 1 (MCH1R) Melanin-concentrating hormone receptor 1 (MCH-1) Melanin-concentrating hormone receptor 1 (MCHR-1) SLC-1 Somatostatin receptor-like protein
Type:
G Protein-Coupled Receptor (GPCR)
Mol. Mass.:
45976.27
Organism:
Homo sapiens (Human)
Description:
Membranes from CHO-K1 cells stably expressing human MCH1R were used in assays.
Residue:
422
  
Inhibitor
Name:
BDBM50340348
Synonyms:
2-(3-trifluoromethylphenyl)-1-{3-[4-(3-acetylaminophenyl)piperidin-1-yl]propyl}-1H-benzimidazole | CHEMBL1761105
Type:
Small organic molecule
Emp. Form.:
C30H31F3N4O
Mol. Mass.:
520.5885
SMILES:
CC(=O)Nc1cccc(c1)C1CCN(CCCn2c(nc3ccccc23)-c2cccc(c2)C(F)(F)F)CC1
: