Target
3 beta-hydroxysteroid dehydrogenase/Delta 5-->4-isomerase
Ligand
BDBM50340479
Substrate
Meas. Tech.
ChEMBL_741233 (CHEMBL1764602)
IC50
>50000±n/a nM
Citation
 Thomas, STYang, XSampson, NS Inhibition of the M. tuberculosis 3β-hydroxysteroid dehydrogenase by azasteroids. Bioorg Med Chem Lett 21:2216-9 (2011)  
Target
Name:
3 beta-hydroxysteroid dehydrogenase/Delta 5-->4-isomerase
Synonyms:
3BHS_MYCTU
Type:
PROTEIN
Mol. Mass.:
40743.62
Organism:
Mycobacterium tuberculosis
Description:
ChEMBL_741233
Residue:
370
  
Inhibitor
Name:
BDBM50340479
Synonyms:
(1S,3aS,3bS,9aR,9bS,11aS)-5-butyl-N,N-diethyl-9a,11a-dimethyl-7-oxo-2,3,3a,3b,4,5,7,8,9,9a,9b,10,11,11a-tetradecahydro-1H-cyclopenta[i]phenanthridine-1-carboxamide | CHEMBL1762036
Type:
Small organic molecule
Emp. Form.:
C27H44N2O2
Mol. Mass.:
428.6505
SMILES:
CCCCN1C[C@H]2[C@@H]3CC[C@H](C(=O)N(CC)CC)[C@@]3(C)CC[C@@H]2[C@@]2(C)CCC(=O)C=C12
: