Target
Bombesin receptor subtype-3
Ligand
BDBM50340973
Substrate
Meas. Tech.
ChEMBL_740068 (CHEMBL1763128)
EC50
>10000±n/a nM
Citation
 Lo, MMChobanian, HRPalyha, OKan, YKelly, TMGuan, XMReitman, MLDragovic, JLyons, KANargund, RPLin, LS Pyridinesulfonylureas and pyridinesulfonamides as selective bombesin receptor subtype-3 (BRS-3) agonists. Bioorg Med Chem Lett 21:2040-3 (2011)  
Target
Name:
Bombesin receptor subtype-3
Synonyms:
BRS3_MOUSE | Brs3
Type:
PROTEIN
Mol. Mass.:
44239.49
Organism:
Mus musculus
Description:
ChEMBL_1445902
Residue:
399
  
Inhibitor
Name:
BDBM50340973
Synonyms:
(R)-N-(tert-butylcarbamoyl)-4-(quinuclidin-3-ylamino)pyridine-3-sulfonamide | CHEMBL1762256
Type:
Small organic molecule
Emp. Form.:
C17H27N5O3S
Mol. Mass.:
381.493
SMILES:
CC(C)(C)NC(=O)NS(=O)(=O)c1cnccc1N[C@H]1CN2CCC1CC2
: