Target
Cytochrome P450 3A4
Ligand
BDBM50340991
Substrate
Meas. Tech.
ChEMBL_740159 (CHEMBL1763219)
IC50
>30000±n/a nM
Citation
 Riether, DWu, LCirillo, PFBerry, AWalker, ERErmann, MNoya-Marino, BJenkins, JEAlbaugh, DAlbrecht, CFisher, MGemkow, MJGrbic, HLöbbe, SMöller, CO'Shea, KSauer, AShih, DTThomson, DS 1,4-Diazepane compounds as potent and selective CB2 agonists: optimization of metabolic stability. Bioorg Med Chem Lett 21:2011-6 (2011)  
Target
Name:
Cytochrome P450 3A4
Synonyms:
Albendazole monooxygenase CP3A4_HUMAN CYP3A4 CYPIIIA4 Cytochrome P450 3A4 (CYP3A4) Nifedipine oxidase Taurochenodeoxycholate 6-alpha-hydroxylase
Type:
Enzyme
Mol. Mass.:
57349.57
Organism:
Homo sapiens (Human)
Description:
Residue:
503
  
Inhibitor
Name:
BDBM50340991
Synonyms:
4-(1,1-Dioxo-1lambda*6*-thiomorpholine-4-carbonyl)-[1,4]diazepane-1-carboxylic acid(5-tert-butyl-isoxazol-3-yl)-amide | CHEMBL1762429
Type:
Small organic molecule
Emp. Form.:
C18H29N5O5S
Mol. Mass.:
427.518
SMILES:
CC(C)(C)c1cc(NC(=O)N2CCCN(CC2)C(=O)N2CCS(=O)(=O)CC2)no1
: