Target
Cannabinoid receptor 2
Ligand
BDBM50341005
Substrate
Meas. Tech.
ChEMBL_740154 (CHEMBL1763214)
EC50
1690±n/a nM
Citation
 Riether, DWu, LCirillo, PFBerry, AWalker, ERErmann, MNoya-Marino, BJenkins, JEAlbaugh, DAlbrecht, CFisher, MGemkow, MJGrbic, HLöbbe, SMöller, CO'Shea, KSauer, AShih, DTThomson, DS 1,4-Diazepane compounds as potent and selective CB2 agonists: optimization of metabolic stability. Bioorg Med Chem Lett 21:2011-6 (2011)  
Target
Name:
Cannabinoid receptor 2
Synonyms:
CANNABINOID CB2 CB2 CB2B CNR2_HUMAN Cannabinoid CB2 receptor Cannabinoid receptor 2 (CB2R) | hCB2
Type:
G Protein-Coupled Receptor (GPCR)
Mol. Mass.:
39690.94
Organism:
Homo sapiens (Human)
Description:
P34972
Residue:
360
  
Inhibitor
Name:
BDBM50341005
Synonyms:
CHEMBL1762424 | N-(5-tert-butylisoxazol-3-yl)-4-(1-(methylsulfonyl)piperidine-4-carbonyl)-1,4-diazepane-1-carboxamide
Type:
Small organic molecule
Emp. Form.:
C20H33N5O5S
Mol. Mass.:
455.572
SMILES:
CC(C)(C)c1cc(NC(=O)N2CCCN(CC2)C(=O)C2CCN(CC2)S(C)(=O)=O)no1
: