Target
Cytochrome P450 2D6
Ligand
BDBM50341008
Substrate
Meas. Tech.
ChEMBL_740158 (CHEMBL1763218)
IC50
>30000±n/a nM
Citation
 Riether, DWu, LCirillo, PFBerry, AWalker, ERErmann, MNoya-Marino, BJenkins, JEAlbaugh, DAlbrecht, CFisher, MGemkow, MJGrbic, HLöbbe, SMöller, CO'Shea, KSauer, AShih, DTThomson, DS 1,4-Diazepane compounds as potent and selective CB2 agonists: optimization of metabolic stability. Bioorg Med Chem Lett 21:2011-6 (2011)  
Target
Name:
Cytochrome P450 2D6
Synonyms:
CP2D6_HUMAN CYP2DL1 Cytochrome P450 2D6 (CYP2D6) P450-DB1
Type:
Protein
Mol. Mass.:
55774.82
Organism:
Homo sapiens (Human)
Description:
P10635
Residue:
497
  
Inhibitor
Name:
BDBM50341008
Synonyms:
4-[2-(1,1-Dioxo-1lambda*6*-thiomorpholin-4-yl)-acetyl]-[1,4]diazepane-1-carboxylic acid(5-tert-butyl-isoxazol-3-yl)-amide | CHEMBL1762427
Type:
Small organic molecule
Emp. Form.:
C19H31N5O5S
Mol. Mass.:
441.545
SMILES:
CC(C)(C)c1cc(NC(=O)N2CCCN(CC2)C(=O)CN2CCS(=O)(=O)CC2)no1
: