Target
Cytochrome P450 2C9
Ligand
BDBM50341008
Substrate
Meas. Tech.
ChEMBL_740157 (CHEMBL1763217)
IC50
>30000±n/a nM
Citation
 Riether, DWu, LCirillo, PFBerry, AWalker, ERErmann, MNoya-Marino, BJenkins, JEAlbaugh, DAlbrecht, CFisher, MGemkow, MJGrbic, HLöbbe, SMöller, CO'Shea, KSauer, AShih, DTThomson, DS 1,4-Diazepane compounds as potent and selective CB2 agonists: optimization of metabolic stability. Bioorg Med Chem Lett 21:2011-6 (2011)  
Target
Name:
Cytochrome P450 2C9
Synonyms:
(R)-limonene 6-monooxygenase CP2C9_HUMAN CYP2C9 Cytochrome P450 2C9 (CYP2C9 ) P-450MP P450 PB-1 | S-mephenytoin 4-hydroxylase
Type:
Enzyme
Mol. Mass.:
55636.33
Organism:
Homo sapiens (Human)
Description:
P11712
Residue:
490
  
Inhibitor
Name:
BDBM50341008
Synonyms:
4-[2-(1,1-Dioxo-1lambda*6*-thiomorpholin-4-yl)-acetyl]-[1,4]diazepane-1-carboxylic acid(5-tert-butyl-isoxazol-3-yl)-amide | CHEMBL1762427
Type:
Small organic molecule
Emp. Form.:
C19H31N5O5S
Mol. Mass.:
441.545
SMILES:
CC(C)(C)c1cc(NC(=O)N2CCCN(CC2)C(=O)CN2CCS(=O)(=O)CC2)no1
: