Target
Cytochrome P450 2D6
Ligand
BDBM50341023
Substrate
Meas. Tech.
ChEMBL_740158 (CHEMBL1763218)
IC50
>30000±n/a nM
Citation
 Riether, DWu, LCirillo, PFBerry, AWalker, ERErmann, MNoya-Marino, BJenkins, JEAlbaugh, DAlbrecht, CFisher, MGemkow, MJGrbic, HLöbbe, SMöller, CO'Shea, KSauer, AShih, DTThomson, DS 1,4-Diazepane compounds as potent and selective CB2 agonists: optimization of metabolic stability. Bioorg Med Chem Lett 21:2011-6 (2011)  
Target
Name:
Cytochrome P450 2D6
Synonyms:
CP2D6_HUMAN CYP2DL1 Cytochrome P450 2D6 (CYP2D6) P450-DB1
Type:
Protein
Mol. Mass.:
55774.82
Organism:
Homo sapiens (Human)
Description:
P10635
Residue:
497
  
Inhibitor
Name:
BDBM50341023
Synonyms:
CHEMBL1762293 | N-(5-tert-butylisoxazol-3-yl)-4-(tetrahydro-2H-pyran-4-carbonyl)-1,4-diazepane-1-carboxamide
Type:
Small organic molecule
Emp. Form.:
C19H30N4O4
Mol. Mass.:
378.4659
SMILES:
CC(C)(C)c1cc(NC(=O)N2CCCN(CC2)C(=O)C2CCOCC2)no1
: