Target
Cannabinoid receptor 1
Ligand
BDBM50341033
Substrate
Meas. Tech.
ChEMBL_740155 (CHEMBL1763215)
EC50
19300±n/a nM
Citation
 Riether, DWu, LCirillo, PFBerry, AWalker, ERErmann, MNoya-Marino, BJenkins, JEAlbaugh, DAlbrecht, CFisher, MGemkow, MJGrbic, HLöbbe, SMöller, CO'Shea, KSauer, AShih, DTThomson, DS 1,4-Diazepane compounds as potent and selective CB2 agonists: optimization of metabolic stability. Bioorg Med Chem Lett 21:2011-6 (2011)  
Target
Name:
Cannabinoid receptor 1
Synonyms:
CANN6 CB-R CNR CNR1_HUMAN Cannabinoid receptor Cannabinoid receptor 1 (brain)
Type:
G Protein-Coupled Receptor (GPCR)
Mol. Mass.:
52868.96
Organism:
Homo sapiens (Human)
Description:
P21554
Residue:
472
  
Inhibitor
Name:
BDBM50341033
Synonyms:
CHEMBL1762282 | N-(4-tert-butylphenyl)-4-(3-cyclopentylpropanoyl)-1,4-diazepane-1-carboxamide
Type:
Small organic molecule
Emp. Form.:
C24H37N3O2
Mol. Mass.:
399.5695
SMILES:
CC(C)(C)c1ccc(NC(=O)N2CCCN(CC2)C(=O)CCC2CCCC2)cc1
: