Target
Cannabinoid receptor 2
Ligand
BDBM50341017
Substrate
Meas. Tech.
ChEMBL_740154 (CHEMBL1763214)
EC50
96±n/a nM
Citation
 Riether, DWu, LCirillo, PFBerry, AWalker, ERErmann, MNoya-Marino, BJenkins, JEAlbaugh, DAlbrecht, CFisher, MGemkow, MJGrbic, HLöbbe, SMöller, CO'Shea, KSauer, AShih, DTThomson, DS 1,4-Diazepane compounds as potent and selective CB2 agonists: optimization of metabolic stability. Bioorg Med Chem Lett 21:2011-6 (2011)  
Target
Name:
Cannabinoid receptor 2
Synonyms:
CANNABINOID CB2 CB2 CB2B CNR2_HUMAN Cannabinoid CB2 receptor Cannabinoid receptor 2 (CB2R) | hCB2
Type:
G Protein-Coupled Receptor (GPCR)
Mol. Mass.:
39690.94
Organism:
Homo sapiens (Human)
Description:
P34972
Residue:
360
  
Inhibitor
Name:
BDBM50341017
Synonyms:
CHEMBL1762286 | N-(4-tert-butylphenyl)-4-(4-methylpentanoyl)-1,4-diazepane-1-carboxamide
Type:
Small organic molecule
Emp. Form.:
C22H35N3O2
Mol. Mass.:
373.5322
SMILES:
CC(C)CCC(=O)N1CCCN(CC1)C(=O)Nc1ccc(cc1)C(C)(C)C
: