Target
Cannabinoid receptor 2
Ligand
BDBM50341020
Substrate
Meas. Tech.
ChEMBL_740154 (CHEMBL1763214)
EC50
2.7±n/a nM
Citation
 Riether, DWu, LCirillo, PFBerry, AWalker, ERErmann, MNoya-Marino, BJenkins, JEAlbaugh, DAlbrecht, CFisher, MGemkow, MJGrbic, HLöbbe, SMöller, CO'Shea, KSauer, AShih, DTThomson, DS 1,4-Diazepane compounds as potent and selective CB2 agonists: optimization of metabolic stability. Bioorg Med Chem Lett 21:2011-6 (2011)  
Target
Name:
Cannabinoid receptor 2
Synonyms:
CANNABINOID CB2 CB2 CB2B CNR2_HUMAN Cannabinoid CB2 receptor Cannabinoid receptor 2 (CB2R) | hCB2
Type:
G Protein-Coupled Receptor (GPCR)
Mol. Mass.:
39690.94
Organism:
Homo sapiens (Human)
Description:
P34972
Residue:
360
  
Inhibitor
Name:
BDBM50341020
Synonyms:
CHEMBL1762290 | N-(4-tert-butylphenyl)-4-(4-(trifluoromethyl)benzoyl)-1,4-diazepane-1-carboxamide
Type:
Small organic molecule
Emp. Form.:
C24H28F3N3O2
Mol. Mass.:
447.4932
SMILES:
CC(C)(C)c1ccc(NC(=O)N2CCCN(CC2)C(=O)c2ccc(cc2)C(F)(F)F)cc1
: