Target
Histamine H1 receptor
Ligand
BDBM50418271
Substrate
Meas. Tech.
ChEMBL_741667 (CHEMBL1769659)
Kd
1.26±n/a nM
Citation
 Procopiou, PABrowning, CBuckley, JMClark, KLFechner, LGore, PMHancock, APHodgson, STHolmes, DSKranz, MLooker, BEMorriss, KMParton, DLRussell, LJSlack, RJSollis, SLVile, SWatts, CJ The discovery of phthalazinone-based human H1 and H3 single-ligand antagonists suitable for intranasal administration for the treatment of allergic rhinitis. J Med Chem 54:2183-95 (2011)  
Target
Name:
Histamine H1 receptor
Synonyms:
H1R HISTAMINE H1 HRH1_HUMAN
Type:
G Protein-Coupled Receptor (GPCR)
Mol. Mass.:
55808.72
Organism:
Homo sapiens (Human)
Description:
Cell pellets from SK-N-MC cells transfected with human H1 receptor were used in binding assay.
Residue:
487
  
Inhibitor
Name:
BDBM50418271
Synonyms:
CHEMBL1767167
Type:
Small organic molecule
Emp. Form.:
C40H51ClN4O2
Mol. Mass.:
655.312
SMILES:
Clc1ccc(Cc2nn(C[C@H]3CCCN3CCCCCc3ccc(OCCCN4CCCCCC4)cc3)c(=O)c3ccccc23)cc1
: