Target
Matrix metalloproteinase-14
Ligand
BDBM50341816
Substrate
Meas. Tech.
ChEMBL_743597 (CHEMBL1768097)
IC50
1.3±n/a nM
Citation
 Shiozaki, MMaeda, KMiura, TKotoku, MYamasaki, TMatsuda, IAoki, KYasue, KImai, HUbukata, MSuma, AYokota, MHotta, TTanaka, MHase, YHaas, JFryer, AMLaird, ERLittmann, NMAndrews, SWJosey, JAMimura, TShinozaki, YYoshiuchi, HInaba, T Discovery of (1S,2R,3R)-2,3-dimethyl-2-phenyl-1-sulfamidocyclopropanecarboxylates: novel and highly selective aggrecanase inhibitors. J Med Chem 54:2839-63 (2011)  
Target
Name:
Matrix metalloproteinase-14
Synonyms:
MMP-14 MMP14 MT-MMP 1 MT1MMP Matrix Metalloproteinase-14 (MMP-14) Matrix metalloproteinase-14 Membrane-type matrix metalloproteinase 1 | Membrane-type-1 matrix metalloproteinase
Type:
Protein
Mol. Mass.:
65900.19
Organism:
Homo sapiens (Human)
Description:
P50281
Residue:
582
  
Inhibitor
Name:
BDBM50341816
Synonyms:
(1S,2R,3R)-1-[5-(4-Methoxypyrazol-1-yl)thiophene-2-sulfonylamino]-2-methyl-3-phenylcyclopropanecarboxylic Acid | CHEMBL1766899
Type:
Small organic molecule
Emp. Form.:
C19H19N3O5S2
Mol. Mass.:
433.501
SMILES:
COc1cnn(c1)-c1ccc(s1)S(=O)(=O)N[C@]1([C@H](C)[C@@H]1c1ccccc1)C(O)=O
: