Target
A disintegrin and metalloproteinase with thrombospondin motifs 5
Ligand
BDBM50341817
Substrate
Meas. Tech.
ChEMBL_743598 (CHEMBL1768098)
IC50
23±n/a nM
Citation
 Shiozaki, MMaeda, KMiura, TKotoku, MYamasaki, TMatsuda, IAoki, KYasue, KImai, HUbukata, MSuma, AYokota, MHotta, TTanaka, MHase, YHaas, JFryer, AMLaird, ERLittmann, NMAndrews, SWJosey, JAMimura, TShinozaki, YYoshiuchi, HInaba, T Discovery of (1S,2R,3R)-2,3-dimethyl-2-phenyl-1-sulfamidocyclopropanecarboxylates: novel and highly selective aggrecanase inhibitors. J Med Chem 54:2839-63 (2011)  
Target
Name:
A disintegrin and metalloproteinase with thrombospondin motifs 5
Synonyms:
A disintegrin and metalloproteinase with thrombospondin motifs 5 (ADAMTS-5) ADAMTS5 ATS5_HUMAN Metalloproteinase with thrombospondin motifs 5 (ADAMTS-5)
Type:
Enzyme
Mol. Mass.:
101769.09
Organism:
Homo sapiens (Human)
Description:
Q9UNA0
Residue:
930
  
Inhibitor
Name:
BDBM50341817
Synonyms:
(1S,2R,3R)-1-(6-Chlorothieno[3',2':4,5]imidazo[1,2-a]pyridine-2-sulfonylamino)-2-methyl-3-phenylcyclopropanecarboxylic Acid | CHEMBL1766901
Type:
Small organic molecule
Emp. Form.:
C20H16ClN3O4S2
Mol. Mass.:
461.942
SMILES:
C[C@@H]1[C@H](c2ccccc2)[C@]1(NS(=O)(=O)c1cc2nc3cc(Cl)ccn3c2s1)C(O)=O
: