Target
A disintegrin and metalloproteinase with thrombospondin motifs 5
Ligand
BDBM50341786
Substrate
Meas. Tech.
ChEMBL_743598 (CHEMBL1768098)
IC50
37±n/a nM
Citation
 Shiozaki, MMaeda, KMiura, TKotoku, MYamasaki, TMatsuda, IAoki, KYasue, KImai, HUbukata, MSuma, AYokota, MHotta, TTanaka, MHase, YHaas, JFryer, AMLaird, ERLittmann, NMAndrews, SWJosey, JAMimura, TShinozaki, YYoshiuchi, HInaba, T Discovery of (1S,2R,3R)-2,3-dimethyl-2-phenyl-1-sulfamidocyclopropanecarboxylates: novel and highly selective aggrecanase inhibitors. J Med Chem 54:2839-63 (2011)  
Target
Name:
A disintegrin and metalloproteinase with thrombospondin motifs 5
Synonyms:
A disintegrin and metalloproteinase with thrombospondin motifs 5 (ADAMTS-5) ADAMTS5 ATS5_HUMAN Metalloproteinase with thrombospondin motifs 5 (ADAMTS-5)
Type:
Enzyme
Mol. Mass.:
101769.09
Organism:
Homo sapiens (Human)
Description:
Q9UNA0
Residue:
930
  
Inhibitor
Name:
BDBM50341786
Synonyms:
(1S,2R,3R)-1-[(R)-4-(4-Chlorophenyl)-3-methylpiperazine-1-sulfonylamino]-2-methyl-3-phenylcyclopropanecarboxylic Acid | CHEMBL1766908
Type:
Small organic molecule
Emp. Form.:
C22H26ClN3O4S
Mol. Mass.:
463.978
SMILES:
C[C@@H]1[C@H](c2ccccc2)[C@]1(NS(=O)(=O)N1CCN([C@H](C)C1)c1ccc(Cl)cc1)C(O)=O
: