Target
A disintegrin and metalloproteinase with thrombospondin motifs 5
Ligand
BDBM50341797
Substrate
Meas. Tech.
ChEMBL_743598 (CHEMBL1768098)
IC50
39±n/a nM
Citation
 Shiozaki, MMaeda, KMiura, TKotoku, MYamasaki, TMatsuda, IAoki, KYasue, KImai, HUbukata, MSuma, AYokota, MHotta, TTanaka, MHase, YHaas, JFryer, AMLaird, ERLittmann, NMAndrews, SWJosey, JAMimura, TShinozaki, YYoshiuchi, HInaba, T Discovery of (1S,2R,3R)-2,3-dimethyl-2-phenyl-1-sulfamidocyclopropanecarboxylates: novel and highly selective aggrecanase inhibitors. J Med Chem 54:2839-63 (2011)  
Target
Name:
A disintegrin and metalloproteinase with thrombospondin motifs 5
Synonyms:
A disintegrin and metalloproteinase with thrombospondin motifs 5 (ADAMTS-5) ADAMTS5 ATS5_HUMAN Metalloproteinase with thrombospondin motifs 5 (ADAMTS-5)
Type:
Enzyme
Mol. Mass.:
101769.09
Organism:
Homo sapiens (Human)
Description:
Q9UNA0
Residue:
930
  
Inhibitor
Name:
BDBM50341797
Synonyms:
(1S,2R,3R)-1-(8-Chloro-1,2,3,4-tetrahydropyrazino[1,2-a]indole-2-sulfonylamino)-2-methyl-3-phenylcyclopropanecarboxylic Acid | CHEMBL1766919
Type:
Small organic molecule
Emp. Form.:
C22H22ClN3O4S
Mol. Mass.:
459.946
SMILES:
C[C@@H]1[C@H](c2ccccc2)[C@]1(NS(=O)(=O)N1CCn2c(C1)cc1cc(Cl)ccc21)C(O)=O
: