Target
Farnesyl diphosphate synthase
Ligand
BDBM50341915
Substrate
Meas. Tech.
ChEMBL_743413 (CHEMBL1767767)
IC50
>1000±n/a nM
Citation
 Rosso, VSSzajnman, SHMalayil, LGalizzi, MMoreno, SNDocampo, RRodriguez, JB Synthesis and biological evaluation of new 2-alkylaminoethyl-1,1-bisphosphonic acids against Trypanosoma cruzi and Toxoplasma gondii targeting farnesyl diphosphate synthase. Bioorg Med Chem 19:2211-7 (2011)  
Target
Name:
Farnesyl diphosphate synthase
Synonyms:
Type:
PROTEIN
Mol. Mass.:
48827.21
Organism:
Trypanosoma cruzi
Description:
ChEMBL_939177
Residue:
425
  
Inhibitor
Name:
BDBM50341915
Synonyms:
1-[(n-Tetradec-1-ylamino)ethyl]1,1-bisphosphonic acid | CHEMBL1765150
Type:
Small organic molecule
Emp. Form.:
C16H37NO6P2
Mol. Mass.:
401.4156
SMILES:
CCCCCCCCCCCCCCNCC(P(O)(O)=O)P(O)(O)=O
: