Target
Farnesyl diphosphate synthase
Ligand
BDBM12576
Substrate
Meas. Tech.
ChEMBL_743413 (CHEMBL1767767)
IC50
27±n/a nM
Citation
 Rosso, VSSzajnman, SHMalayil, LGalizzi, MMoreno, SNDocampo, RRodriguez, JB Synthesis and biological evaluation of new 2-alkylaminoethyl-1,1-bisphosphonic acids against Trypanosoma cruzi and Toxoplasma gondii targeting farnesyl diphosphate synthase. Bioorg Med Chem 19:2211-7 (2011)  
Target
Name:
Farnesyl diphosphate synthase
Synonyms:
Type:
PROTEIN
Mol. Mass.:
48827.21
Organism:
Trypanosoma cruzi
Description:
ChEMBL_939177
Residue:
425
  
Inhibitor
Name:
BDBM12576
Synonyms:
Bisphosphonate 1 JMC515594 Compound 64 Risdronate [1-hydroxy-1-phosphono-2-(pyridin-3-yl)ethyl]phosphonic acid
Type:
Small organic molecule
Emp. Form.:
C7H11NO7P2
Mol. Mass.:
283.1123
SMILES:
OC(Cc1cccnc1)(P(O)(O)=O)P(O)(O)=O
: