Target
Hydroxycarboxylic acid receptor 2
Ligand
BDBM50342415
Substrate
Meas. Tech.
ChEMBL_744532 (CHEMBL1772553)
Ki
2400±n/a nM
Citation
 van Veldhoven, JPBlad, CCArtsen, CMKlopman, CWolfram, DRAbdelkadir, MJLane, JRBrussee, JIjzerman, AP Structure-activity relationships of trans-substituted-propenoic acid derivatives on the nicotinic acid receptor HCA2 (GPR109A). Bioorg Med Chem Lett 21:2736-9 (2011)  
Target
Name:
Hydroxycarboxylic acid receptor 2
Synonyms:
G-protein coupled receptor 109A GPR109A HCAR2 HM74A NIACR1 Nicotinic acid receptor 1
Type:
G Protein-Coupled Receptor (GPCR)
Mol. Mass.:
41868.22
Organism:
Homo sapiens (Human)
Description:
Membranes from CHO cells expressing the recombinant human GPR109A were used in competition binding assay.
Residue:
363
  
Inhibitor
Name:
BDBM50342415
Synonyms:
3-Fluorobenzyl fumarate | CHEMBL1771745
Type:
Small organic molecule
Emp. Form.:
C11H9FO4
Mol. Mass.:
224.1852
SMILES:
OC(=O)\C=C\C(=O)OCc1cccc(F)c1
: